{"text_format":"1","workbook":"xlsx","n_sheets":12,"sheets":["Cover Sheet","Competitive","Scoresheet","Named Ranges","TOC Data","Dropdown Lists","Cover Sheet Links","Competitve Information","4% Only","Sheet2","Sheet1","Sheet3"],"not_rendered":{"charts":0,"images":0,"macros":1,"external_links":0,"defined_names":570,"comments":0,"pivot_tables":0},"unopened":[],"bounds":{"document_bytes":16777216,"sheet_cells":100000,"rows_first":2000,"rows_last":500,"rows_between":2000,"halvings":0,"cell_chars":16384,"cell_head_chars":4096},"cells_cut":0,"cells_raw":0,"read":"whole","date_system":"1900"}

{"sheet":"Cover Sheet","index":0,"n_rows":38,"n_cols":5,"rows_kept":38,"cut":false,"hidden":false,"merged":[[1,0,2,3],[10,1,10,9],[12,2,12,9],[20,2,20,9],[7,0,7,15],[6,0,6,15]]}
[]
[null,null,null,null,"Multifamily 2021 Housing Tax Credit Self-Scoring Worksheets"]
[null,null,null,null,"and 2020 Request for Proposals Deferred Loan Priority Checklist"]
[]
["Updated 2020 02 07",null,null,"Ver 1.0"]
[]
["INSTRUCTIONS"]
["When you indicate the type of funding you are applying for, the applicable Housing Tax Credit Self-scoring Worksheet or Deferred Loan Priority Checklist will open. If you go back to the Cover Sheet and change your selection, the sheet will update to reflect the Cover Sheet selection’s criteria. Minnesota Housing will only review the submitted information based on the selection made on the Cover Sheet.\n\nIf you are submitting a dual application, complete and save your primary scoresheet first.  Then you can 'save as' to save a new scoresheet or start from a blank scoresheet to complete you dual application scoresheet.\n\nNOTE: Unchecking your funding type selection after beginning to enter data in the scoresheet will clear all information that has been entered.\n\n"]
{"$rows_left_out":31}
{"sheet":"Competitive","index":1,"n_rows":807,"n_cols":18,"rows_kept":807,"cut":false,"hidden":true,"merged":[[263,16,266,18],[267,3,267,13],[0,0,0,18],[1,0,1,18],[508,4,508,13],[511,2,511,13],[514,2,514,13],[111,0,111,15],[405,4,405,13],[131,3,131,15],[279,2,279,13],[209,5,209,13],[210,5,210,13],[205,4,205,13],[232,3,232,13],[166,0,166,13],[220,2,220,12],[249,4,249,13],[235,3,235,13],[233,3,233,13],[212,4,212,13],[252,5,252,13],[466,0,466,13],[332,3,332,13],[334,5,334,13],[346,5,346,12],[290,4,290,13],[291,4,291,13],[286,3,286,13],[564,6,564,13],[526,4,526,13],[562,5,562,13],[474,5,474,13],[509,4,509,13],[520,2,520,13],[505,2,505,13],[472,4,472,13],[516,4,516,13],[477,6,477,13],[478,7,478,13],[479,7,479,13],[485,4,485,13],[488,5,488,13],[491,5,491,13],[462,10,462,12],[437,4,437,13],[436,4,436,13],[382,5,382,13],[384,2,384,13],[423,7,423,13],[211,5,211,13],[467,2,467,13],[153,3,153,15],[364,3,364,13],[365,3,365,13],[306,5,306,12],[208,4,208,13],[234,3,234,13],[214,2,214,13],[202,3,202,13],[357,3,357,10],[399,6,399,13],[308,3,308,13],[320,5,320,12],[318,5,318,12],[316,5,316,12],[203,3,203,13],[238,2,238,13],[190,3,190,13],[452,7,452,13],[263,0,263,13],[264,2,264,13],[266,3,266,13],[455,7,455,13],[256,5,256,13],[261,2,261,13],[302,5,302,12],[481,5,481,13],[476,5,476,13],[482,5,482,13],[304,5,304,11],[323,1,323,13],[361,2,361,13],[327,2,327,13],[325,2,325,12],[352,6,352,12],[401,6,401,13],[425,5,425,13],[336,5,336,13],[339,0,339,13],[348,4,348,13],[363,3,363,13],[282,2,282,13],[293,3,293,13],[288,4,288,13],[289,4,289,13],[446,7,446,13],[461,2,461,13],[255,5,255,13],[421,7,421,13],[215,2,215,13],[117,3,117,15],[121,3,121,15],[312,5,312,12],[314,5,314,12],[204,3,204,13],[162,3,162,13],[163,3,163,13],[132,3,132,15],[277,2,277,13],[206,4,206,13],[207,5,207,13],[284,3,284,13],[322,1,322,13],[417,5,417,13],[419,7,419,13],[358,3,358,10],[359,3,359,13],[370,2,370,13],[373,2,373,13],[397,6,397,13],[387,2,387,13],[460,2,460,13],[454,7,454,13],[14,0,14,18],[17,2,17,18],[20,2,20,18],[10,2,10,7],[10,8,10,11],[33,2,33,18],[451,7,451,13],[389,2,389,13],[391,3,391,13],[393,4,393,13],[395,6,395,13],[375,3,375,13],[377,5,377,13],[379,5,379,13],[403,6,403,13],[380,5,380,13],[386,2,386,13],[430,7,430,13],[431,7,431,13],[434,4,434,13],[439,5,439,13],[441,7,441,13],[442,7,442,13],[444,7,444,13],[2,0,2,18],[4,0,4,18],[6,2,6,7],[6,8,6,11],[7,2,7,7],[7,8,7,9],[8,2,8,7],[8,8,8,9],[9,2,9,7],[9,8,9,11],[57,2,57,18],[60,2,60,18],[72,3,72,18],[22,2,22,18],[29,2,29,18],[35,2,35,18],[39,2,39,18],[42,2,42,18],[68,3,68,18],[71,3,71,18],[69,3,69,18],[124,5,124,15],[125,5,125,15],[122,4,122,15],[45,2,45,18],[62,0,62,18],[64,0,64,18],[23,2,23,18],[26,2,26,18],[36,2,36,18],[47,2,47,18],[54,2,54,18],[74,3,74,18],[78,3,78,18],[80,2,80,16],[49,0,49,18],[52,0,52,18],[50,2,50,18],[28,0,28,9],[30,2,30,8],[51,2,51,8],[152,3,152,15],[193,4,193,13],[108,0,108,15],[109,0,109,15],[110,0,110,15],[143,3,143,15],[145,3,145,15],[146,3,146,15],[154,3,154,15],[133,3,133,15],[135,3,135,15],[136,3,136,15],[137,3,137,15],[159,3,159,13],[160,3,160,13],[130,3,130,15],[161,3,161,13],[123,5,123,15],[139,3,139,15],[140,3,140,15],[141,3,141,15],[142,3,142,15],[148,3,148,15],[151,3,151,15],[487,5,487,13],[490,5,490,13],[480,7,480,13],[475,6,475,13],[795,1,795,13],[796,1,796,13],[758,3,758,13],[759,3,759,13],[714,0,714,13],[727,2,727,13],[728,3,728,13],[729,3,729,13],[730,3,730,13],[731,3,731,13],[723,5,723,13],[738,3,738,13],[739,3,739,13],[732,3,732,13],[733,3,733,13],[649,3,649,13],[734,3,734,13],[737,3,737,13],[721,5,721,13],[717,3,717,13],[719,3,719,13],[664,3,664,13],[678,2,678,13],[679,3,679,13],[680,3,680,13],[705,4,705,13],[710,2,710,13],[685,3,685,13],[686,3,686,13],[688,2,688,13],[692,3,692,13],[673,8,673,13],[683,3,683,13],[684,3,684,13],[700,8,700,13],[682,3,682,13],[681,3,681,13],[674,8,674,13],[804,1,804,13],[760,3,760,13],[764,3,764,13],[797,1,797,13],[798,1,798,13],[746,3,746,13],[747,3,747,13],[748,3,748,13],[754,3,754,13],[755,3,755,13],[749,3,749,13],[757,3,757,13],[750,3,750,13],[801,1,801,13],[802,1,802,13],[762,2,762,13],[765,3,765,13],[767,3,767,13],[793,0,793,13],[751,3,751,13],[752,3,752,13],[753,3,753,13],[799,1,799,13],[800,1,800,13],[613,5,613,13],[574,2,574,13],[614,5,614,13],[545,6,545,13],[643,2,643,13],[652,3,652,13],[539,5,539,13],[540,6,540,13],[541,6,541,13],[542,5,542,13],[543,5,543,13],[544,6,544,13],[565,6,565,13],[556,6,556,13],[558,4,558,13],[563,5,563,13],[648,3,648,13],[356,2,356,13],[354,6,354,12],[247,4,247,13],[248,4,248,13],[250,4,250,13],[296,5,296,12],[300,5,300,12],[619,2,619,13],[672,8,672,13],[671,8,671,13],[253,5,253,13],[254,5,254,13],[257,5,257,13],[258,5,258,13],[259,4,259,13],[251,5,251,13],[371,2,371,13],[447,7,447,13],[449,5,449,13],[647,3,647,13],[670,8,670,13],[665,3,665,13],[499,4,499,13],[468,2,468,13],[806,0,806,13],[428,7,428,13],[171,5,171,12],[180,3,180,13],[169,3,169,13],[175,2,175,13],[528,2,528,13],[530,0,530,13],[407,6,407,13],[410,6,410,12],[411,6,411,13],[408,6,408,13],[413,3,413,13],[415,4,415,13],[326,2,326,13],[783,0,783,8],[741,2,741,13],[742,3,742,13],[743,3,743,13],[744,3,744,13],[745,3,745,13],[756,3,756,13],[525,4,525,13],[651,3,651,13],[483,6,483,13],[492,5,492,13],[523,2,523,13],[645,4,645,13],[535,2,535,13],[512,2,512,13],[521,2,521,11],[518,2,518,13],[506,2,506,13],[626,3,626,13],[551,4,551,13],[553,5,553,13],[554,5,554,13],[555,6,555,13],[560,4,560,13],[616,5,616,13],[531,1,531,13],[533,2,533,13],[537,4,537,13],[642,2,642,13],[634,8,634,13],[635,8,635,13],[576,3,576,13],[638,4,638,13],[470,4,470,13],[201,3,201,13],[546,6,546,13],[547,5,547,13],[566,6,566,13],[567,6,567,13],[569,2,569,13],[632,8,632,13],[633,8,633,13],[494,3,494,13],[496,2,496,13],[498,4,498,13],[501,2,501,13],[503,2,503,13],[457,2,457,13],[458,2,458,13],[571,2,571,13],[464,2,464,13],[623,3,623,13],[625,3,625,13],[615,4,615,13],[618,0,618,13],[630,8,630,13],[631,8,631,13],[12,0,12,18],[106,0,106,16],[328,2,328,13],[330,2,330,13],[340,2,340,13],[342,3,342,13],[126,4,126,13],[147,3,147,13],[240,2,240,13],[216,3,216,13],[217,3,217,13],[230,2,230,13],[236,3,236,13],[242,2,242,13],[243,3,243,13],[244,3,244,13],[245,3,245,13],[246,3,246,13],[222,3,222,11],[219,16,219,17],[178,2,178,13],[177,2,177,13],[197,2,197,13],[199,2,199,13],[463,2,463,13],[602,3,602,13],[604,5,604,13],[605,5,605,13],[606,4,606,13],[607,5,607,13],[646,3,646,13],[656,4,656,13],[654,3,654,13],[655,4,655,13],[653,3,653,13],[611,3,611,13],[536,2,536,13],[582,6,582,13],[573,2,573,13],[621,3,621,13],[639,4,639,13],[641,2,641,13],[650,3,650,13],[636,8,636,13],[644,3,644,13],[489,5,489,13],[486,5,486,13],[471,4,471,13],[774,2,774,13],[775,2,775,13],[777,4,777,13],[778,4,778,13],[780,4,780,13],[781,4,781,13],[657,4,657,13],[658,4,658,13],[660,2,660,13],[676,4,676,13],[735,3,735,13],[736,3,736,13],[769,2,769,13],[771,2,771,13],[773,2,773,13],[712,2,712,10],[694,3,694,13],[707,4,707,13],[698,8,698,13],[699,8,699,13],[715,2,715,13],[706,4,706,13],[709,2,709,13],[701,8,701,13]]}
["Multifamily Deferred Only Priority Checklist"]
["2020 Request for Proposals"]
["2021 Housing Tax Credit Self-Scoring Worksheet"]
["Housing Tax Credit projects submitted in a Competitive funding round*"]
["Updated October 2019"]
[]
[null,null,"Project Name:"]
[null,null,"Property Number (D#):",null,null,null,null,null,null,null,"Include \"D\" in the Property Number."]
{"$rows_left_out":800}
{"sheet":"Scoresheet","index":2,"n_rows":784,"n_cols":18,"rows_kept":784,"cut":false,"hidden":true,"merged":[[777,1,777,13],[778,1,778,13],[779,1,779,13],[781,1,781,13],[783,0,783,13],[770,0,770,13],[772,1,772,13],[773,1,773,13],[774,1,774,13],[775,1,775,13],[776,1,776,13],[737,3,737,13],[739,2,739,13],[741,3,741,13],[742,3,742,13],[744,3,744,13],[760,0,760,8],[732,3,732,13],[733,3,733,13],[734,3,734,13],[735,3,735,13],[736,3,736,13],[746,2,746,13],[748,2,748,13],[750,2,750,13],[751,2,751,13],[752,2,752,13],[754,4,754,13],[755,4,755,13],[757,4,757,13],[758,4,758,13],[726,3,726,13],[727,3,727,13],[728,3,728,13],[729,3,729,13],[730,3,730,13],[731,3,731,13],[720,3,720,13],[721,3,721,13],[722,3,722,13],[723,3,723,13],[724,3,724,13],[725,3,725,13],[713,3,713,13],[714,3,714,13],[715,3,715,13],[716,3,716,13],[718,2,718,13],[719,3,719,13],[706,3,706,13],[707,3,707,13],[708,3,708,13],[709,3,709,13],[710,3,710,13],[711,3,711,13],[712,3,712,13],[694,3,694,13],[696,3,696,13],[698,5,698,13],[700,5,700,13],[704,2,704,13],[705,3,705,13],[685,2,685,13],[686,2,686,13],[687,2,687,13],[689,2,689,10],[691,0,691,13],[692,2,692,13],[676,8,676,13],[680,4,680,13],[681,4,681,13],[663,2,663,13],[667,3,667,13],[669,3,669,13],[673,8,673,13],[674,8,674,13],[675,8,675,13],[656,3,656,13],[657,3,657,13],[658,3,658,13],[659,3,659,13],[660,3,660,13],[661,3,661,13],[648,8,648,13],[649,8,649,13],[653,2,653,13],[654,3,654,13],[655,3,655,13],[635,2,635,13],[639,3,639,13],[640,3,640,13],[645,8,645,13],[646,8,646,13],[647,8,647,13],[624,3,624,13],[625,3,625,13],[626,3,626,13],[627,3,627,13],[628,3,628,13],[629,3,629,13],[630,4,630,13],[631,4,631,13],[632,4,632,13],[633,4,633,13],[620,4,620,13],[622,3,622,13],[623,3,623,13],[613,4,613,13],[614,4,614,13],[616,2,616,13],[617,2,617,13],[618,2,618,13],[619,3,619,13],[621,3,621,13],[607,8,607,13],[608,8,608,13],[609,8,609,13],[610,8,610,13],[611,8,611,13],[596,3,596,13],[598,3,598,13],[600,3,600,13],[601,3,601,13],[605,8,605,13],[606,8,606,13],[588,5,588,13],[589,5,589,13],[590,4,590,13],[591,5,591,13],[593,0,593,13],[594,2,594,13],[545,2,545,13],[548,2,548,13],[549,2,549,13],[551,3,551,13],[557,6,557,13],[586,3,586,13],[581,4,581,13],[579,5,579,13],[580,5,580,13],[582,5,582,13],[537,5,537,13],[538,6,538,13],[539,6,539,13],[540,6,540,13],[541,6,541,13],[543,2,543,13],[528,5,528,13],[529,6,529,13],[530,6,530,13],[532,4,532,13],[534,4,534,13],[536,5,536,13],[518,6,518,13],[519,6,519,13],[520,6,520,13],[521,5,521,13],[525,4,525,13],[527,5,527,13],[511,4,511,13],[513,5,513,13],[514,6,514,13],[515,6,515,13],[516,5,516,13],[517,5,517,13],[504,0,504,13],[505,1,505,13],[507,2,507,13],[509,2,509,13],[510,2,510,13],[494,2,494,13],[495,2,495,11],[497,2,497,13],[499,4,499,13],[500,4,500,13],[502,2,502,13],[483,4,483,13],[485,2,485,13],[486,2,486,13],[488,2,488,13],[490,4,490,13],[492,2,492,13],[473,4,473,13],[475,2,475,13],[477,2,477,13],[479,2,479,13],[480,2,480,13],[482,4,482,13],[464,5,464,13],[465,5,465,13],[466,5,466,13],[468,3,468,13],[470,2,470,13],[472,4,472,13],[459,4,459,13],[460,5,460,13],[461,5,461,13],[462,5,462,13],[463,5,463,13],[454,7,454,13],[455,5,455,13],[456,5,456,13],[457,6,457,13],[448,5,448,13],[449,6,449,13],[450,5,450,13],[451,6,451,13],[452,7,452,13],[453,7,453,13],[440,0,440,13],[441,2,441,13],[442,2,442,13],[444,4,444,13],[445,4,445,13],[446,4,446,13],[432,2,432,13],[434,2,434,13],[435,2,435,13],[436,10,436,12],[437,2,437,13],[438,2,438,13],[425,7,425,13],[426,7,426,13],[428,7,428,13],[429,7,429,13],[431,2,431,13],[415,7,415,13],[417,7,417,13],[418,7,418,13],[420,7,420,13],[421,7,421,13],[423,5,423,13],[402,7,402,13],[404,7,404,13],[405,7,405,13],[407,4,407,13],[412,5,412,13],[414,7,414,13],[389,4,389,13],[391,5,391,13],[393,7,393,13],[395,7,395,13],[397,7,397,13],[399,5,399,13],[409,4,409,13],[410,4,410,13],[379,4,379,13],[381,6,381,13],[382,6,382,13],[384,6,384,12],[385,6,385,13],[387,3,387,13],[367,4,367,13],[369,6,369,13],[371,6,371,13],[373,6,373,13],[375,6,375,13],[377,6,377,13],[356,5,356,13],[358,2,358,13],[360,2,360,13],[361,2,361,13],[363,2,363,13],[365,3,365,13],[345,2,345,13],[347,2,347,13],[349,3,349,13],[351,5,351,13],[353,5,353,13],[354,5,354,13],[332,3,332,10],[333,3,333,10],[334,3,334,13],[336,2,336,13],[344,2,344,13],[313,0,313,13],[314,2,314,13],[316,3,316,13],[327,6,327,12],[329,6,329,12],[331,2,331,13],[338,3,338,13],[339,3,339,13],[340,3,340,13],[302,3,302,13],[305,5,305,13],[307,5,307,13],[309,5,309,13],[311,5,311,13],[289,5,289,12],[291,1,291,13],[293,1,293,13],[295,2,295,12],[296,2,296,13],[297,2,297,13],[298,2,298,13],[303,3,303,13],[281,5,281,12],[283,5,283,12],[285,5,285,12],[287,5,287,12],[268,5,268,12],[270,5,270,12],[272,5,272,11],[274,5,274,12],[300,2,300,13],[257,4,257,13],[258,4,258,13],[259,4,259,13],[261,3,261,13],[264,5,264,12],[250,2,250,13],[252,3,252,13],[254,3,254,13],[276,3,276,13],[246,2,246,13],[248,2,248,13],[226,5,226,13],[227,4,227,13],[229,2,229,13],[231,0,231,13],[232,2,232,13],[234,3,234,13],[256,4,256,13],[220,5,220,13],[221,5,221,13],[222,5,222,13],[223,5,223,13],[224,5,224,13],[225,5,225,13],[214,3,214,13],[215,4,215,13],[216,4,216,13],[217,4,217,13],[218,4,218,13],[219,5,219,13],[206,2,206,13],[208,2,208,13],[210,2,210,13],[211,3,211,13],[212,3,212,13],[213,3,213,13],[198,2,198,13],[200,3,200,13],[201,3,201,13],[202,3,202,13],[203,3,203,13],[204,3,204,13],[184,3,184,13],[185,3,185,13],[187,16,187,17],[188,2,188,12],[190,3,190,11],[177,4,177,13],[178,5,178,13],[179,5,179,13],[180,5,180,13],[181,4,181,13],[183,2,183,13],[171,3,171,13],[172,3,172,13],[173,3,173,13],[174,4,174,13],[175,4,175,13],[176,5,176,13],[149,3,149,13],[159,3,159,13],[162,4,162,13],[166,2,166,13],[168,2,168,13],[170,3,170,13],[107,3,107,15],[108,3,108,15],[109,3,109,15],[134,0,134,13],[137,3,137,13],[139,5,139,12],[144,2,144,13],[146,2,146,13],[147,2,147,13],[118,3,118,13],[119,3,119,13],[123,3,123,15],[124,3,124,13],[125,3,125,13],[126,3,126,13],[129,3,129,15],[130,3,130,15],[105,3,105,15],[24,2,24,15],[30,2,30,15],[61,2,61,15],[45,2,45,15],[48,2,48,15],[50,2,50,15],[53,2,53,15],[94,4,94,13],[95,5,95,13],[80,0,80,15],[81,0,81,15],[82,0,82,15],[88,3,88,13],[92,3,92,13],[93,4,93,13],[27,2,27,15],[34,2,34,15],[37,2,37,15],[62,2,62,8],[31,2,31,8],[22,2,22,15],[192,5,192,13],[196,5,196,13],[194,5,194,13],[77,2,77,15],[79,0,79,13],[55,2,55,15],[58,2,58,15],[65,2,65,15],[68,2,68,15],[71,2,71,15],[74,2,74,15],[96,5,96,13],[97,5,97,13],[98,4,98,13],[102,3,102,13],[111,3,111,15],[112,3,112,13],[113,3,113,13],[114,3,114,13],[115,3,115,15],[117,3,117,15],[103,3,103,13],[104,3,104,13],[1,0,1,13],[231,16,233,19],[683,4,683,13],[682,4,682,13],[0,0,0,13],[2,0,2,13],[3,0,3,13],[4,0,4,13],[9,2,9,7],[9,8,9,11],[10,2,10,7],[10,8,10,11],[12,2,12,15],[14,0,14,13],[6,2,6,7],[6,8,6,11],[7,2,7,7],[7,8,7,9],[8,2,8,7],[8,8,8,9],[39,2,39,15],[42,2,42,15],[17,2,17,15],[20,2,20,15]]}
["Deferred Loan Request with 4% Housing Tax Credit Self-Scoring Worksheet"]
["2021 Housing Tax Credit Self-Scoring Worksheet"]
["4% Housing Tax Credits Only"]
["Deferred Loan Request with 4% Housing Tax Credit projects submitted in a Competitive funding round*"]
["Updated October 2019"]
[]
[null,null,"Project Name:"]
[null,null,"Property Number (D#):",null,null,null,null,null,null,null,"Include \"D\" in the Property Number"]
{"$rows_left_out":777}
{"sheet":"Named Ranges","index":3,"n_rows":196,"n_cols":22,"rows_kept":196,"cut":false,"hidden":true,"merged":[]}
["Display Order","Header","Main Section","Sub Sect 1","Sub Sect 2","Sub Sect 3","QSTN_TMPLT_INCL_SUB_TOT_VAL","QSTN_TMPT_SCR_TYP_CD","Checkbox Name","QSTN_TMPLT_FRMT_CD","QSTN_TMPLT_SCALE_NUM","Named Range for Values","Values","Section Min","Section Max","Question Points"]
[1,"Round 1 - Minimum Threshold Requirements",null,null,null,null,null,null,null,null,null,null,null,null,null,null,null,false,null,null,"DevelopmentName",{"$f":"IF('Cover Sheet Links'!SelectedScoresheet=\"Competitive\", Competitive!DevelopmentName_Competitive, IF('Cover Sheet Links'!SelectedScoresheet=\"Scoresheet\", Scoresheet!DevelopmentName_4Percent, \"\"))","v":0}]
[2,null,"In the Metropolitan Area",null,null,null,null,null,null,null,null,null,null,null,null,null,null,null,null,null,"DevelopmentNumber",{"$f":"IF('Cover Sheet Links'!SelectedScoresheet=\"Competitive\", Competitive!DevelopmentNumber_Competitive, IF('Cover Sheet Links'!SelectedScoresheet=\"Scoresheet\", Scoresheet!DevelopmentNumber_4Percent, \"\"))","v":0}]
[3,null,null,null,null,null,null,"CHECKBOX","ckMTRMetroSRO","Boolean",null,"MTRMetroSRO",false,null,null,null,null,null,null,null,"ApplicationNumber",{"$f":"IF('Cover Sheet Links'!SelectedScoresheet=\"Competitive\", Competitive!ApplicationNumber_Competitive, IF('Cover Sheet Links'!SelectedScoresheet=\"Scoresheet\", Scoresheet!ApplicationNumber_4Percent, \"\"))","v":0}]
[4,null,null,null,null,null,null,"CHECKBOX","ckMTRMetroLargeFamily","Boolean",null,"MTRMetroLargeFamily",false,null,null,null,null,null,null,null,"DevelopmentLocation",{"$f":"IF('Cover Sheet Links'!SelectedScoresheet=\"Competitive\", Competitive!DevelopmentLocation_Competitive, IF('Cover Sheet Links'!SelectedScoresheet=\"Scoresheet\", Scoresheet!DevelopmentLocation_4Percent, \"\"))","v":0}]
[5,null,null,null,null,null,null,"CHECKBOX","ckMTRMetroRehabilitation","Boolean",null,"MTRMetroRehabilitation",false,null,null,null,null,null,null,null,"DevelopmentCity",{"$f":"IF('Cover Sheet Links'!SelectedScoresheet=\"Competitive\", Competitive!DevelopmentCity_Competitive, IF('Cover Sheet Links'!SelectedScoresheet=\"Scoresheet\", Scoresheet!DevelopmentCity_4Percent, \"\"))","v":0}]
[6,null,"Outside the Metropolitan Area"]
[7,null,null,null,null,null,null,"CHECKBOX","ckMTRShortSupply","Boolean",null,"MTRShortSupply",false]
{"$rows_left_out":189}
{"sheet":"TOC Data","index":4,"n_rows":71,"n_cols":4,"rows_kept":71,"cut":false,"hidden":true,"merged":[]}
["Minimum Threshold Requirements",null,"chkClrMTRMetroSRO",-6]
["Strategic Priority Thresholds",null,"chkClrSPTAccessToFixedTransit",-9]
["Selection Criteria",null,"chkClrLargeFamily2Bedroom",-6]
["Greatest Need Tenant Targeting",null,"chkClrLargeFamily2Bedroom",-5]
[null,"Large Family","chkClrLargeFamily2Bedroom",-4]
[null,"Permanent Supportive Housing - Homeless","chkClrSupportiveHousing20Units",-7]
[null,"People with Disabilities","chkClrDisabilities15Percent",-5]
["Serves Lowest Income for Long Durations",null,"chkClrServesLowestIncOpt1",-11]
{"$rows_left_out":64}
{"sheet":"Dropdown Lists","index":5,"n_rows":23,"n_cols":3,"rows_kept":23,"cut":false,"hidden":true,"merged":[]}
["High Priority Homeless List",null,"Unacceptable Practices list"]
["Families with Children",null,-4]
["Youth Singles",null,-5]
["Youth with Children",null,-6]
["Single Adults",null,-7]
[null,null,-8]
[null,null,-9]
[null,null,-10]
{"$rows_left_out":16}
{"sheet":"Cover Sheet Links","index":6,"n_rows":10,"n_cols":7,"rows_kept":10,"cut":false,"hidden":true,"merged":[]}
["Workbook Name:","2020 Self Scoring Workbook",null,null,null,null,"Workbook named range is used by Pentaho extraction job"]
["Workbook Version:","2020 02 07 Ver 1",null,null,null,null,"Version named range is used by Pentaho extraction job"]
[]
[]
["Funding Type Selected"]
["ckCompOnly","Competitive","Competitive","COMPScoresheet",false,"4Percent","FundingTypeSelected named range is used by Pentaho extraction job"]
["ckCompAndDef","Competitive","Competitive","COMPAndDefScoresheet",false,"HTC4"]
["ckDEFOnly","Competitive","Deferred","DEFOnlyScoresheet",false,"Scoresheet"]
{"$rows_left_out":3}
{"sheet":"Competitve Information","index":7,"n_rows":197,"n_cols":22,"rows_kept":197,"cut":false,"hidden":true,"merged":[]}
["Address",null,"Row","R1C1 Address",null,null,"Range Name",null,"Section","Sub Section","Checkbox Names",null,"Checkbox Link","Address","Row","Column",null,null,null,"9% and 9% w/Deferred"]
["$A$1:$S$2","A",1,"=Competitive!R1C1:R2C19",null,"Form Header","Header_Deferred",null,null,null,null,null,null,null,null,null,null,null,null,null,"Indicates enabled for any SPT checkbox selection"]
["$A$3:$S$4","A",3,"=Competitive!R3C1:R4C19",null,"Form Header","Header_Competitive",null,null,null,null,null,null,null,null,null,null,null,null,null,"Indicates enabled for listed SPT checkbox selection"]
["$I$9",null,null,"=Competitive!R9C9",null,"Project Information","ApplicationNumber",null,null,null,null,null,null,null,null,null,null,null,null,null,null,"SPTSupportiveHsg"]
["$I$11",null,null,"=Competitive!R11C9",null,"Project Information","DevelopmentCity",null,null,null,null,null,null,null,null,null,null,null,null,null,null,"SPTEconomicIntegration"]
["$I$10",null,null,"=Competitive!R10C9",null,"Project Information","DevelopmentLocation",null,null,null,null,null,null,null,null,null,null,null,null,null,null,"SPTPreservation"]
["$I$7",null,null,"=Competitive!R7C9",null,"Project Information","DevelopmentName",null,null,null,null,null,null,null,null,null,null,null,null,null,null,"SPTPlannedCommunity"]
["$I$8",null,null,"=Competitive!R8C9",null,"Project Information","DevelopmentNumber"]
{"$rows_left_out":190}
{"sheet":"4% Only","index":8,"n_rows":184,"n_cols":19,"rows_kept":184,"cut":false,"hidden":true,"merged":[]}
["Address","Column","Row","R1C1 Address","Range Name",null,null,null,null,null,"Checkbox Names",null,"Checkbox Link","Address","Row","Column",null,"4% w/Deferred"]
["$A$1,$A$3","A",1,"='4 Percent'!R1C1,'4 Percent'!R3C1","Worksheet_Header_HTCandDef",null,"Form Header",null,null,null,null,null,null,null,null,null,null,null,"Enabled when proposal type is selected"]
["$A$1:$N$2","A",1,"='4 Percent'!R1C1:R2C14","Worksheet_Header_HTC",null,"Form Header",null,null,null,null,null,null,null,null,null,null,null,"Enabled for all SPT checkbox selections"]
["$I$6","I",6,"='4 Percent'!R6C9","DevelopmentName",null,"Project Information"]
["$I$7","I",7,"='4 Percent'!R7C9","DevelopmentNumber",null,"Project Information",null,null,null,null,null,null,null,null,null,null,"4% Only"]
["$I$8","I",8,"='4 Percent'!R8C9","ApplicationNumber",null,"Project Information",null,null,null,null,null,null,null,null,null,null,null,"Disabled when proposal type is selected"]
["$I$9","I",9,"='4 Percent'!R9C9","DevelopmentLocation",null,"Project Information",null,null,null,null,null,null,null,null,null,null,null,"Enabled when proposal type is selected"]
["$I$10","I",10,"='4 Percent'!R10C9","DevelopmentCity",null,"Project Information"]
{"$rows_left_out":177}
{"sheet":"Sheet2","index":9,"n_rows":547,"n_cols":4,"rows_kept":547,"cut":false,"hidden":true,"merged":[]}
["R1C1","Scope","Name","Address"]
["='4 Percent'!R8C9","4 Percent","ApplicationNumber","$I$8"]
["='4 Percent'!R340C5","4 Percent","chkClrAccessToSchools","$E$340"]
["='4 Percent'!R678C4,'4 Percent'!R680C4","4 Percent","chkClrCostContainment","$D$678,$D$680"]
["='4 Percent'!R586C5","4 Percent","chkClrCriticalAffordableUnits","$E$586"]
["='4 Percent'!R192C5","4 Percent","chkClrDisabilities10Percent","$E$192"]
["='4 Percent'!R190C5","4 Percent","chkClrDisabilities15Percent","$E$190"]
["='4 Percent'!R194C5","4 Percent","chkClrDisabilities5Percent","$E$194"]
{"$rows_left_out":540}
{"sheet":"Sheet1","index":10,"n_rows":208,"n_cols":11,"rows_kept":208,"cut":false,"hidden":true,"merged":[]}
["HelpText_SPT_AllSPTandSPTQuestionHelpText",null,"New Name","Old Name",null,null,null,null,null,"Competitive, Competitive with deferred and Deferred only Hide All","4% and 4% with deferred"]
[null,"HelpText_SPT_AllSPTHelpText"]
[null,null,"HelpText_SPT","InstructionsStrategicPriorityThresholds",107,null,null,null,null,"Worksheet_DeferredLanguage_Instructions","Worksheet_CompetitiveLanguage_End"]
[null,null,"HelpText_SPT_EconomicIntegration","InstructionsStrategicPriorityThresholdsEconomicIntegration",128,null,348,null,null,"Worksheet_CompetitiveLanguage_Instructions","Worksheet_CompetitiveLanguage_PermanentSupportiveHousing"]
[null,null,"HelpText_SPT_PlannedCommunityDevelopment","InstructionsStrategicPriorityThresholdsPlannedCommunityDevelopment",138,null,466,null,null,"Worksheet_CompetitiveLanguage_CostContainmentCaution","Worksheet_DeferredLanguage_EconomicIntegration"]
[null,null,"HelpText_SPT_Preservation","InstructionsStrategicPriorityThresholdsPreservation",144,null,529,null,null,"Worksheet_CompetitiveLanguage_CostContainmentProcess","Worksheet_DeferredLanguage_OpeningNote"]
[null,null,"HelpText_SPT_SupportiveHousing","InstructionsStrategicPriorityThresholdsSupportiveHousing",150,null,175,217,null,"Worksheet_CompetitiveLanguage_EconomicIntegration","Worksheet_DeferredLanguage_PermanentSupportiveHousing"]
[null,null,null,null,null,null,null,null,null,"Worksheet_CompetitiveLanguage_End","Worksheet_Header_Deferred"]
{"$rows_left_out":201}
{"sheet":"Sheet3","index":11,"n_rows":0,"n_cols":0,"rows_kept":0,"cut":false,"hidden":true,"merged":[]}