{"text_format":"1","workbook":"xlsx","n_sheets":6,"sheets":["Overview","Aid Funds Worksheet","LFHE Worksheet","Data Upload","AidCerts","FYears"],"not_rendered":{"charts":0,"images":0,"macros":1,"external_links":0,"defined_names":9,"comments":0,"pivot_tables":0},"unopened":[],"bounds":{"document_bytes":16777216,"sheet_cells":100000,"rows_first":2000,"rows_last":500,"rows_between":2000,"halvings":0,"cell_chars":16384,"cell_head_chars":4096},"cells_cut":0,"cells_raw":0,"read":"whole","date_system":"1900"}

{"sheet":"Overview","index":0,"n_rows":14,"n_cols":2,"rows_kept":14,"cut":false,"hidden":false,"merged":[]}
["Local and Statewide Affordable Housing Aid (LAHA and SAHA) Annual Reporting to Minnesota Housing:\nInstructions for Completing and Submitting this Annual Reporting Workbook"]
["Version 1.0.4 (Final) (November 2025)"]
["To complete:","1. Review the Aid Funds Worksheet and LFHE Worksheet (the other two \"tabs\" in this Excel Workbook) to familiarize yourself with them."]
[null,"2. Select the name of the Aid Recipient (city, county or Tribal Nation) for which you are   completing this workbook from the dropdown in Cell B5 of the Aid Funds Worksheet."]
[null,"3. Complete the Aid Funds Worksheet according to the instructions in that worksheet."]
[null,"4. Complete the LFHE Worksheet according to the instructions in that worksheet."]
["To submit:","Please save this Annual Reporting Workbook using the naming convention \"[Name of Aid Recipient]_2025 Annual Reporting Workbook\" and upload to the Box.com folder specified by Minnesota Housing staff for this purpose."]
[null,"To ensure access to the specified Box.com folder, provide Minnesota Housing with contact information for up to three staff members of the Aid Recipient who need access using this link: "]
[null,"Provide primary contact information for purposes of LAHA and SAHA reporting."]
[null,"These staff contacts will be granted permission in Box.com to share access with others in their organization."]
["For more information:","Review the reporting instructions at Minnesota Housing's Local Government Housing Programs webpage:"]
[null,"https://mnhousing.gov/local-government/local-and-statewide-affordable-housing-aid.html"]
[null,"Please direct any questions or concerns about the instructions or this workbook to localhousingaid.mhfa@state.mn.us. Please do not email this workbook."]
["End of worksheet."]

{"sheet":"Aid Funds Worksheet","index":1,"n_rows":108,"n_cols":15,"rows_kept":108,"cut":false,"hidden":false,"merged":[[77,1,77,3],[74,1,74,3],[71,1,71,3]]}
["2025 Local and Statewide Affordable Housing Aid (LAHA and SAHA) Annual Report to Minnesota Housing: \nAid Fund Expenditures and Commitments Worksheet"]
[{"$f":"Overview!A2","v":"Version 1.0.4 (Final) (November 2025)"}]
["Visit Minnesota Housing's Local and Statewide Affordable Housing Aid web page for complete LAHA and SAHA reporting forms and instructions, including definitions of capitalized terms."]
["Aid Recipient (City, County or Tribal Nation)","Aid Recipient"]
["Please select the name of the Aid Recipient from the dropdown to the right."]
["SECTION 1: SUMMARY OF AID CERTIFIED TO DATE",null,null,null,null,"AID RECIPIENT NOTES"]
["Minnesota Housing's records indicate the Aid Recipient identified above received or has been certified by the Department of Revenue to receive the aid shown below. There is nothing to complete in this section. However, if  any of this information is incorrect, please email\n"]
["localhousingaid.mhfa@state.mn.us.\n",null,null,null,null,"The space below is reserved for notes the Aid Recipient may wish to keep."]
["To review aid certifications, visit the Department of Revenue's Aids, Credits, Levies and Budgeting website."]
["Type of Aid","Amount(s) Certified for Aid Year 2023 (SAHA Only)","Amount(s) Certified for Aid Year 2024","Amount(s) Certified for Aid Year 2025","Total",null,null,"Actual Expenditure","Expenditure from 2023 Aid Funds","Aid Year 2023 Unexpended Balance","Expenditure from 2024 Aid Funds","Aid Year 2024 Unexpended balance","Expenditure from 2025 Aid Funds","Aid Year 2025 Unexpended Balance","Total Unexpended Balance"]
["LAHA ",{"$f":"IF($B$5=\"\",\"Select Aid Recipient above\",VLOOKUP($B$5,AidCerts!$A$3:$H$204,6,FALSE))","v":"Select Aid Recipient above"},{"$f":"IF($B$5=\"\",\"Select Aid Recipient above\",VLOOKUP($B$5,AidCerts!$A$3:$H$204,7,FALSE))","v":"Select Aid Recipient above"},{"$f":"IF($B$5=\"\",\"Select Aid Recipient above\",VLOOKUP($B$5,AidCerts!$A$3:$H$204,8,FALSE))","v":"Select Aid Recipient above"},{"$f":"SUM(B11:D11)","v":0},null,"Starting",0,0,{"$f":"B13","v":"Select Aid Recipient above"},0,{"$f":"C13","v":"Select Aid Recipient above"},0,{"$f":"D13","v":"Select Aid Recipient above"},{"$f":"J11+L11+N11","v":{"$error":"#VALUE!"}}]
["SAHA ",{"$f":"IF($B$5=\"\",\"Select Aid Recipient above\",VLOOKUP($B$5,AidCerts!$A$3:$H$204,3,FALSE))","v":"Select Aid Recipient above"},{"$f":"IF($B$5=\"\",\"Select Aid Recipient above\",VLOOKUP($B$5,AidCerts!$A$3:$H$204,4,FALSE))","v":"Select Aid Recipient above"},{"$f":"IF($B$5=\"\",\"Select Aid Recipient above\",VLOOKUP($B$5,AidCerts!$A$3:$H$204,5,FALSE))","v":"Select Aid Recipient above"},{"$f":"SUM(B12:D12)","v":0},null,"2023 Expenditure 1",{"$f":"IF(ISBLANK(B23),0,B23)","v":0},{"$f":"MIN(J11,B23)","v":0},{"$f":"J11-I12","v":{"$error":"#VALUE!"}},{"$f":"IF(J12<=0,MIN(H12-I12,L11),0)","v":{"$error":"#VALUE!"}},{"$f":"L11-K12","v":{"$error":"#VALUE!"}},{"$f":"IF(L12<=0,MIN(H12-I12-K12,N11),0)","v":{"$error":"#VALUE!"}},{"$f":"N11-M12","v":{"$error":"#VALUE!"}},{"$error":"#VALUE!"}]
["TOTAL",{"$f":"IF($B$5=\"\",\"Select Aid Recipient above\",B11+B12)","v":"Select Aid Recipient above"},{"$f":"IF($B$5=\"\",\"Select Aid Recipient above\",C11+C12)","v":"Select Aid Recipient above"},{"$f":"IF($B$5=\"\",\"Select Aid Recipient above\",D11+D12)","v":"Select Aid Recipient above"},{"$f":"SUM(B13:D13)","v":0},null,"2023 Expenditure 2",{"$f":"B24","v":0},{"$f":"MIN(J12,B24)","v":{"$error":"#VALUE!"}},{"$error":"#VALUE!"},{"$error":"#VALUE!"},{"$error":"#VALUE!"},{"$error":"#VALUE!"},{"$error":"#VALUE!"},{"$error":"#VALUE!"}]
["Commitment Deadline (LAHA and SAHA)","2026-12-31","2027-12-31","2028-12-31","N/A",null,"2023 Expenditure 3",{"$f":"B25","v":0},{"$f":"MIN(J13,B25)","v":{"$error":"#VALUE!"}},{"$error":"#VALUE!"},{"$error":"#VALUE!"},{"$error":"#VALUE!"},{"$error":"#VALUE!"},{"$error":"#VALUE!"},{"$error":"#VALUE!"}]
["LAHA Expenditure Deadline","N/A",{"$f":"C14+365","v":"2028-12-30"},{"$f":"D14+365","v":"2029-12-31"},"N/A",null,"2023 Expenditure 4",{"$f":"B26","v":0},{"$f":"MIN(J14,B26)","v":{"$error":"#VALUE!"}},{"$error":"#VALUE!"},{"$error":"#VALUE!"},{"$error":"#VALUE!"},{"$error":"#VALUE!"},{"$error":"#VALUE!"},{"$error":"#VALUE!"}]
["SAHA Expenditure Deadline","2027-12-31",{"$f":"C15","v":"2028-12-30"},{"$f":"D15","v":"2029-12-31"},"N/A",null,"2024 Expenditure 1",{"$f":"C23","v":0},{"$f":"MIN(J15,C23)","v":{"$error":"#VALUE!"}},{"$error":"#VALUE!"},{"$error":"#VALUE!"},{"$error":"#VALUE!"},{"$error":"#VALUE!"},{"$error":"#VALUE!"},{"$error":"#VALUE!"}]
["SECTION 2: AID EXPENDITURES\n",null,null,null,null,null,"2024 Expenditure 2",{"$f":"C24","v":0},{"$f":"MIN(J16,C24)","v":{"$error":"#VALUE!"}},{"$error":"#VALUE!"},{"$error":"#VALUE!"},{"$error":"#VALUE!"},{"$error":"#VALUE!"},{"$error":"#VALUE!"},{"$error":"#VALUE!"}]
["Please complete the chart below to indicate how Aid Funds have been expended, according to the qualifying project category and date expended.",null,null,null,null,null,"2024 Expenditure 3",{"$f":"C25","v":0},{"$f":"MIN(J17,C25)","v":{"$error":"#VALUE!"}},{"$error":"#VALUE!"},{"$error":"#VALUE!"},{"$error":"#VALUE!"},{"$error":"#VALUE!"},{"$error":"#VALUE!"},{"$error":"#VALUE!"}]
["To ensure this Worksheet calculates correctly: If any cells in Section 2 or 3 appear highlighted in yellow, click the \"Clear Highlighting in Sections 2 and 3\" button to the right."]
["Aid Available to Expend During All or Part of Each Calendar Year\nAid Funds are considered available to expend once certified by the Minnesota Department of Revenue. However, if the Aid Recipient's policies and procedures, or laws, rules or regulations governing the Aid Recipient's expenditures of Aid Funds, are more restrictive, then the AId Recipient must follow those restrictions.\n","Available to Expend During Calendar Year 2023\n(7/1/2023-12/31/2023)","Available to Expend During Calendar Year 2024\n(1/1/2024-12/31/2024)","Available to Expend During Calendar Year 2025\nThrough Nov. 30 (1/1/2025-11/30/2025)","Total\n(7/1/2023-11/30/2025)"]
{"$rows_left_out":89}
{"sheet":"LFHE Worksheet","index":2,"n_rows":29,"n_cols":5,"rows_kept":29,"cut":false,"hidden":false,"merged":[[20,1,20,3]]}
["2025 Local and Statewide Affordable Housing Aid (LAHA and SAHA) Annual Report to Minnesota Housing:\n Locally Funded Housing Expenditures Worksheet"]
[{"$f":"Overview!A2","v":"Version 1.0.4 (Final) (November 2025)"}]
["NOTE: Locally funded housing expenditures are NOT the same as expenditures of Aid Funds. Do not include expenditures of Local or Statewide Affordable Housing Aid in this Worksheet."]
["\"Locally funded housing expenditures\" are expenditures of the Aid Recipient, including expenditures by a public corporation or  legal entity created by the Aid Recipient, that are:"]
["(1) funded from the Aid Recipient's general fund, a property tax levy of the Aid Recipient or its housing and redevelopment authority, or unrestricted money available to the Aid Recipient, but not including tax increments; and  "]
["(2) expended on certain activities during the Aid Recipient's two prior fiscal years. (For a list of those certain activities, see the \"Activity\" list below, in Cells A13 through A18)."]
["Visit Minnesota Housing's Local and Statewide Affordable Housing Aid web page for complete LAHA and SAHA reporting forms and instructions, including definitions of capitalized terms."]
["Aid Recipient (City, County or Tribal Nation)","Aid Recipient",null,"Date User Prepared (Last Saved):"]
["Please select the name of the Aid Recipient from the dropdown in the \"Aid Funds Worksheet\" tab.",{"$f":"IF(ISBLANK('Aid Funds Worksheet'!B5),\"\",'Aid Funds Worksheet'!B5)","v":""},null,{"$f":"TEXT(LastSavedTimeStamp(),\"MMMM D, YYYY\")","v":"October 2, 2025"}]
["Section 1: Two Prior Fiscal Years' Locally Funded Housing Expenditures.",null,null,null,"Aid Recipient Notes"]
["In the table below, enter the Aid Recipient's locally funded housing expenditures for each of its prior two fiscal years."]
["Activity","Total Locally Funded Housing Expenditures During the Aid Recipient's 2023 Fiscal Year","Total Locally Funded Housing Expenditures During the Aid Recipient's \n2024 Fiscal Year","Year-to-Year Change","The space below is reserved for notes the Aid Recipient may wish to keep."]
["Financial assistance to residents in arrears on rent, mortgage, utilities or property tax payments",0,0,{"$f":"C13-B13","v":0}]
["Support services, case management services, and legal services for residents in arrears on rent, mortgage, utilities or property tax payments",0,0,0]
["Down payment assistance or homeownership education, counseling and training",0,0,0]
["Acquisition, construction, rehabilitation, adaptive reuse, improvement, financing and infrastructure of residential dwellings",0,0,0]
["Costs of operating emergency shelter, transitional housing, supportive housing or publicly owned housing, including costs of providing case management services and support services",0,0,0]
["Rental assistance",0,0,0]
["TOTAL",{"$f":"SUM(B13:B18)","v":0},{"$f":"SUM(C13:C18)","v":0},0]
["Section 2: Explanation of Year-to-Year Reduction\nIs explanation of a reduction required?",{"$f":"IF(D13<0,\"Yes, one or more Locally Funded Housing Expenditures has been reduced. See below for further instruction.\",IF(D14<0,\"Yes, one or more Locally Funded Housing Expenditures has been reduced. See below for further instruction.\",IF(D15<0,\"Yes, one or more Locally Funded Housing Expenditures has been reduced. See below for further instruction.\",IF(D16<0,\"Yes, one or more Locally Funded Housing Expenditures has been reduced. See below for further instruction.\",IF(D17<0,\"Yes, one or more Locally Funded Housing Expenditures has been reduced. See below for further instruction.\",IF(D18<0,\"Yes, one or more Locally Funded Housing Expenditures has been reduced. See below for further instruction.\",\"No\"))))))","v":"No"}]
{"$rows_left_out":10}
{"sheet":"Data Upload","index":3,"n_rows":2,"n_cols":92,"rows_kept":2,"cut":false,"hidden":true,"merged":[]}
["Aid Recepient","2023 SAHA","2024 SAHA","2025 SAHA","2024 LAHA","2025 LAHA","2023 Expended 1","2023 Expended 2","2023 Expended 3","2023 Expended 4","2024 Expended 1","2024 Expended 2","2024 Expended 3","2024 Expended 4","2024 Expended 5","2024 Expended 6","2024 Expended 7","2024 Expended 8","2025 Expended 1","2025 Expended 2","2025 Expended 3","2025 Expended 4","2025 Expended 5","2025 Expended 6","2025 Expended 7","2025 Expended 8","Total Expended 1","Total Expended 2","Total Expended 3","Total Expended 4","Total Expended 5","Total Expended 6","Total Expended 7","Total Expended 8","Total Not Expended","2023 Committed 1","2023 Committed 2","2023 Committed 3","2023 Committed 4","2024 Committed 1","2024 Committed 2","2024 Committed 3","2024 Committed 4","2024 Committed 5","2024 Committed 6","2024 Committed 7","2024 Committed 8","2025 Committed 1","2025 Committed 2","2025 Committed 3","2025 Committed 4","2025 Committed 5","2025 Committed 6","2025 Committed 7","2025 Committed 8","Total Commitments","Total Commitments + Expenditures","2023 Uncommitted Recapture","2024 Uncommitted Recpature","2025 Uncommitted Recapture","Total Uncommitted Recapture","2023 Unexpended Recapture","2024 Unexpended Recapture","2025 Unexpended Recapture","Total Unexpended Recapture","Total Unexpended and/or Uncommited Recapture","Name","Email","Phone","5a Description Required","5a Description","5b Explanation Required","5b Explanation","5c Demonstration Required","5c Demonstration","Date Prepared","2023 Financial assistance to residents in arrears on rent, mortgage, utilities or property tax payments","2023 Support services, case management services, and legal services for residents in arrears on rent, mortgage, utilities or property tax payments","2023 Down payment assistance or homeownership education, counseling and training","2023 Acquisition, construction, rehabilitation, adaptive reuse, improvement, financing and infrastructure of residential dwellings","2023 Costs of operating emergency shelter, transitional housing, supportive housing or publicly owned housing, including costs of providing case management services and support services","2023 Rental assistance","Total Expenditures 2023 Fiscal Year","2024 Financial assistance to residents in arrears on rent, mortgage, utilities or property tax payments","2024 Support services, case management services, and legal services for residents in arrears on rent, mortgage, utilities or property tax payments","2024 Down payment assistance or homeownership education, counseling and training","2024 Acquisition, construction, rehabilitation, adaptive reuse, improvement, financing and infrastructure of residential dwellings","2024 Costs of operating emergency shelter, transitional housing, supportive housing or publicly owned housing, including costs of providing case management services and support services","2024 Rental assistance","Total Expenditures 2024 Fiscal Year","2 Explanation Required","2 Explanation"]
[{"$f":"'Aid Funds Worksheet'!$B$5","v":0},{"$f":"'Aid Funds Worksheet'!B12","v":"Select Aid Recipient above"},{"$f":"'Aid Funds Worksheet'!C12","v":"Select Aid Recipient above"},{"$f":"'Aid Funds Worksheet'!D12","v":"Select Aid Recipient above"},{"$f":"'Aid Funds Worksheet'!C11","v":"Select Aid Recipient above"},{"$f":"'Aid Funds Worksheet'!D11","v":"Select Aid Recipient above"},{"$f":"'Aid Funds Worksheet'!B23","v":0},{"$f":"'Aid Funds Worksheet'!B24","v":0},{"$f":"'Aid Funds Worksheet'!B25","v":0},{"$f":"'Aid Funds Worksheet'!B26","v":0},{"$f":"'Aid Funds Worksheet'!C23","v":0},{"$f":"'Aid Funds Worksheet'!C24","v":0},{"$f":"'Aid Funds Worksheet'!C25","v":0},{"$f":"'Aid Funds Worksheet'!C26","v":0},{"$f":"'Aid Funds Worksheet'!C27","v":0},{"$f":"'Aid Funds Worksheet'!C28","v":0},{"$f":"'Aid Funds Worksheet'!C29","v":0},{"$f":"'Aid Funds Worksheet'!C30","v":0},{"$f":"'Aid Funds Worksheet'!D23","v":0},{"$f":"'Aid Funds Worksheet'!D24","v":0},{"$f":"'Aid Funds Worksheet'!D25","v":0},{"$f":"'Aid Funds Worksheet'!D26","v":0},{"$f":"'Aid Funds Worksheet'!D27","v":0},{"$f":"'Aid Funds Worksheet'!D28","v":0},{"$f":"'Aid Funds Worksheet'!D29","v":0},{"$f":"'Aid Funds Worksheet'!D30","v":0},{"$f":"'Aid Funds Worksheet'!E23","v":0},{"$f":"'Aid Funds Worksheet'!E24","v":0},{"$f":"'Aid Funds Worksheet'!E25","v":0},{"$f":"'Aid Funds Worksheet'!E26","v":0},{"$f":"'Aid Funds Worksheet'!E27","v":0},{"$f":"'Aid Funds Worksheet'!E28","v":0},{"$f":"'Aid Funds Worksheet'!E29","v":0},{"$f":"'Aid Funds Worksheet'!E30","v":0},{"$f":"'Aid Funds Worksheet'!E33","v":0},{"$f":"'Aid Funds Worksheet'!B40","v":0},{"$f":"'Aid Funds Worksheet'!B41","v":0},{"$f":"'Aid Funds Worksheet'!B42","v":0},{"$f":"'Aid Funds Worksheet'!B43","v":0},{"$f":"'Aid Funds Worksheet'!C40","v":0},{"$f":"'Aid Funds Worksheet'!C41","v":0},{"$f":"'Aid Funds Worksheet'!C42","v":0},{"$f":"'Aid Funds Worksheet'!C43","v":0},{"$f":"'Aid Funds Worksheet'!C44","v":0},{"$f":"'Aid Funds Worksheet'!C45","v":0},{"$f":"'Aid Funds Worksheet'!C46","v":0},{"$f":"'Aid Funds Worksheet'!C47","v":0},{"$f":"'Aid Funds Worksheet'!D40","v":0},{"$f":"'Aid Funds Worksheet'!D41","v":0},{"$f":"'Aid Funds Worksheet'!D42","v":0},{"$f":"'Aid Funds Worksheet'!D43","v":0},{"$f":"'Aid Funds Worksheet'!D44","v":0},{"$f":"'Aid Funds Worksheet'!D45","v":0},{"$f":"'Aid Funds Worksheet'!D46","v":0},{"$f":"'Aid Funds Worksheet'!D47","v":0},{"$f":"'Aid Funds Worksheet'!E48","v":0},{"$f":"'Aid Funds Worksheet'!E49","v":0},{"$f":"'Aid Funds Worksheet'!E54","v":0},{"$f":"'Aid Funds Worksheet'!E55","v":0},{"$f":"'Aid Funds Worksheet'!E56","v":0},{"$f":"'Aid Funds Worksheet'!E57","v":0},{"$f":"'Aid Funds Worksheet'!E59","v":0},{"$f":"'Aid Funds Worksheet'!E60","v":0},{"$f":"'Aid Funds Worksheet'!E61","v":0},{"$f":"'Aid Funds Worksheet'!E62","v":0},{"$f":"'Aid Funds Worksheet'!E64","v":0},{"$f":"'Aid Funds Worksheet'!B66","v":"<Name of the person completing this form>"},{"$f":"'Aid Funds Worksheet'!B67","v":"<Email address>"},{"$f":"'Aid Funds Worksheet'!B68","v":"<Re-enter Email address to confirm>"},{"$f":"'Aid Funds Worksheet'!B71","v":"No."},{"$f":"'Aid Funds Worksheet'!B72","v":"<If description of other projects is required, please enter it here .>"},{"$f":"'Aid Funds Worksheet'!B74","v":"No."},{"$f":"'Aid Funds Worksheet'!B75","v":"<If explanation of the location of unspent funds is required, please enter it here .>"},{"$f":"'Aid Funds Worksheet'!B77","v":"No."},{"$f":"'Aid Funds Worksheet'!B78","v":"<This Section 5C is provided for informational purposes only. Minnesota Housing anticipates it will begin accepting demonstrations from Aid Recipients that are cities or counties no earlier than late 2026, though only in connection with Aid Funds certified for Aid Year 2023 that the Aid Recipient Committed to (a) Qualifying Project(s) by December 31, 2026. By statute, neither Tribal Nations nor grantees under Minnesota Housing's Greater Minnesota Small Cities (Tier II Cities) Housing Aid Grant Program may spend funds by transferring them to a Local Housing Trust Fund.>"},{"$f":"'Aid Funds Worksheet'!E88","v":"2025-10-01T16:47:58"},{"$f":"'LFHE Worksheet'!B13","v":0},{"$f":"'LFHE Worksheet'!B14","v":0},{"$f":"'LFHE Worksheet'!B15","v":0},{"$f":"'LFHE Worksheet'!B16","v":0},{"$f":"'LFHE Worksheet'!B17","v":0},{"$f":"'LFHE Worksheet'!B19","v":0},{"$f":"'LFHE Worksheet'!B19","v":0},{"$f":"'LFHE Worksheet'!C13","v":0},{"$f":"'LFHE Worksheet'!C14","v":0},{"$f":"'LFHE Worksheet'!C15","v":0},{"$f":"'LFHE Worksheet'!C16","v":0},{"$f":"'LFHE Worksheet'!C17","v":0},{"$f":"'LFHE Worksheet'!C18","v":0},{"$f":"'LFHE Worksheet'!C19","v":0},{"$f":"'LFHE Worksheet'!B20","v":"No"},{"$f":"'LFHE Worksheet'!B21","v":"<If explanation of a reduction in locally funded housing expenditures is required, please enter it here according to the instructions found in the box to the left.>"}]

{"sheet":"AidCerts","index":4,"n_rows":204,"n_cols":8,"rows_kept":204,"cut":false,"hidden":true,"merged":[]}
["City and county information as of May 30, 2025; Tribal Nations information as of 9.22.2025."]
["AID RECIPIENT","Type of Aid Recipient","2023 SAHA","2024 SAHA","2025 SAHA","2023 LAHA","2024 LAHA","2025 LAHA"]
["Aitkin County","County",97222,97222,41754,0,0,0]
["Anoka County","County",417202,417202,179909,0,3390611.15,9123550.3699999992]
["Becker County","County",115216,115216,48848,0,0,0]
["Beltrami County","County",131410,131410,53725,0,0,0]
["Benton County","County",120480,120480,50314,0,0,0]
["Big Stone County","County",83139,83139,35253,0,0,0]
["Blue Earth County","County",165141,165141,69985,0,0,0]
["Bois Forte Band of Chippewa","Tribal Nation",385715,245455,120000,0,0,0]
["Brown County","County",99826,99826,43239,0,0,0]
["Carlton County","County",111092,111092,47700,0,0,0]
["Carver County","County",170595,170595,73460,0,1630367.98,4285474.79]
["Cass County","County",112343,112343,47751,0,0,0]
["Chippewa County","County",91734,91734,39334,0,0,0]
["Chisago County","County",130416,130416,55020,0,0,0]
["City of Albert Lea","City",89520,89520,37415,0,0,0]
["City of Alexandria","City",101341,101341,38219,0,0,0]
["City of Andover","City",0,0,0,0,98152.49,255105.13]
["City of Anoka","City",0,0,0,0,118154.37,300785.48]
{"$rows_left_out":185}
{"sheet":"FYears","index":5,"n_rows":12,"n_cols":3,"rows_kept":12,"cut":false,"hidden":true,"merged":[]}
["Prior Fiscal Years",null,"Second Prior FY"]
["January 1, 2024 - December 31, 2024",null,"January 1, 2023 - December 31, 2023"]
["July 1, 2023 - June 30, 2024",null,"July 1, 2022 - June 30, 2023"]
["October 1, 2023 - September 30, 2024",null,"October 1, 2022 - September 30, 2023"]
[]
[]
[]
[]
["Prior Two Fiscal Years"]
["January 1, 2023 - December 31, 2024"]
["July 1, 2022 - June 30, 2024"]
["October 1, 2022 - September 30, 2024"]