{"text_format":"1","workbook":"xlsx","n_sheets":19,"sheets":["Instructions","Explanations","RentTable","RentMatrix","CapEx","Budget","Budget Notes","Actual","Actual Notes","258 A","258 B","258 C","258 D","OpSubsidy","YEP","Lists","BaseData","Budget Macros","dlgFileSelect"],"not_rendered":{"charts":0,"images":0,"macros":1,"external_links":0,"defined_names":581,"comments":1,"pivot_tables":0},"unopened":[{"sheet":"Budget Macros","index":17,"reason":"part_missing"},{"sheet":"dlgFileSelect","index":18,"reason":"not_a_worksheet"}],"bounds":{"document_bytes":16777216,"sheet_cells":100000,"rows_first":2000,"rows_last":500,"rows_between":2000,"halvings":0,"cell_chars":16384,"cell_head_chars":4096},"cells_cut":0,"cells_raw":0,"read":"whole","date_system":"1900"}

{"sheet":"Instructions","index":0,"n_rows":198,"n_cols":4,"rows_kept":198,"cut":false,"hidden":false,"merged":[[201,2,201,3],[205,2,205,3],[207,2,207,3],[210,2,210,3]]}
[null,"Instructions"]
["2023-08-30"]
[]
[null,"Read me first"]
[null,null,"The file you opened is an Excel template.  Before you begin save it to your computer as a normal "]
[null,null,"Excel workbook.  On the File menu select Save As.  Change the name of the file if you wish.  "]
[null,null,"In the \"Save as type\" box select \"Microsoft Office Excel Macro Enabled Workbook (*.xlsm) and click \"Save\"."]
[]
[null,"Copying data from a previous Budget and Reporting Tool, also called the BudRep, file."]
[null,null,"You may use the button to the right to copy your data from a previous BudRep workbook to this one.  "]
{"$rows_left_out":189}
{"sheet":"Explanations","index":1,"n_rows":479,"n_cols":1,"rows_kept":479,"cut":false,"hidden":false,"merged":[]}
[]
["General Notes"]
[]
["1. Minnesota Housing requires full accrual basis reporting. "]
[]
["2. The management agent needs to upload the monthly operating report no later than the 15th of the month following the reporting month using the Agency Box.com account. Following are the instructions for using this method. \nFirst, request from Minnesota Housing a Property Management Company Box.com Access Request and Account Change Form by emailing to mhfa.am@state.mn.us. Complete the form with all necessary information and submit to Minnesota Housing via that same email address. The Agency will then create a profile for your management company with a folder for each property and subfolders for each property’s audits, budgets and operating reports. Place annual audits in the ‘Audits’ subfolder, monthly operating reports in the ‘Operating Reports’ subfolder, and so on. The Agency will send a flyer titled Box.com Operating Reports, Audits and Budgets Submission Instructions to each user that details all steps for uploading documents to Box.com. "]
[]
["3. If there are entries on Line 98, Adjustments to Cash, or any line labeled \"Other\", an explanation needs to be provided on the \"Actual Notes\" tab.  Always include the month, line #, and amount that is being explained."]
["             "]
["4. Although copies of bank statements are not required, Minnesota Housing reserves the right to request them at any time. "]
{"$rows_left_out":470}
{"sheet":"RentTable","index":2,"n_rows":89,"n_cols":37,"rows_kept":89,"cut":false,"hidden":false,"merged":[[11,24,13,24],[11,25,13,25],[11,26,13,26],[10,19,10,26],[11,19,13,19],[11,20,13,20],[11,21,13,21],[11,22,13,22],[11,23,13,23]]}
[]
[]
["Property Information",null,null,null,null,null,null,null,null,null,null,"Size",null,"# of Rooms"]
["Property Name",null,null,null,null,null,null,null,null,null,null,"Beds",null,2]
["Property Number1",null,null,null,null,"Annual Budget - Schedule A",null,null,null,null,null,"Eff",null,2.5]
[{"$f":"Actual!I4","v":2015},null,null,null,null,"Rent Table",null,null,null,null,null,"One Bedroom",null,3.5]
["Property City",null,null,null,null,null,null,null,null,null,null,"Two Bedroom",null,4.5]
[null,null,null,null,null,null,null,null,null,null,null,"Three Bedroom",null,6]
[null,null,null,null,null,{"$f":"CONCATENATE(\"Budget uses rent from \",IF(A11=2,\"Rent Table\",\"Manual GPR\"),\".\")","v":"Budget uses rent from Rent Table."},null,null,null,null,null,"Four Bedroom",null,7]
[2]
{"$rows_left_out":80}
{"sheet":"RentMatrix","index":3,"n_rows":34,"n_cols":26,"rows_kept":34,"cut":false,"hidden":false,"merged":[]}
[null,null,null,null,{"$f":"RentTable!A4 & \"- \" & RentTable!A5 & \" - \" & RentTable!A7","v":"Property Name- Property Number1 - Property City"},null,null,null,null,null,null,null,null,null,{"$f":"LRMark-P1-2","v":4},{"$f":"ROW(TitleLine)","v":4},{"$f":"ROW(TotalLine)","v":10}]
[]
[null,null,null,null,null,null,null,null,{"$f":"RentTable!B38","v":1},{"$f":"RentTable!C38","v":2},{"$f":"RentTable!D38","v":3},{"$f":"RentTable!E38","v":4},{"$f":"RentTable!F38","v":5},{"$f":"RentTable!G38","v":6},{"$f":"RentTable!H38","v":7},{"$f":"RentTable!I38","v":8},{"$f":"RentTable!J38","v":9},{"$f":"RentTable!K38","v":10},{"$f":"RentTable!L38","v":11},{"$f":"RentTable!M38","v":12}]
["Unit Number","# of Bedrooms","Most Restrictive  Type Code","Rent Subsidy","Current Rent","New Rent","% Change","Adj Month",{"$f":"RentTable!B40 & \" \" & RentTable!B39","v":"January 2015"},{"$f":"RentTable!C40 & \" \" & RentTable!C39","v":"February 2015"},{"$f":"RentTable!D40 & \" \" & RentTable!D39","v":"March 2015"},{"$f":"RentTable!E40 & \" \" & RentTable!E39","v":"April 2015"},{"$f":"RentTable!F40 & \" \" & RentTable!F39","v":"May 2015"},{"$f":"RentTable!G40 & \" \" & RentTable!G39","v":"June 2015"},{"$f":"RentTable!H40 & \" \" & RentTable!H39","v":"July 2015"},{"$f":"RentTable!I40 & \" \" & RentTable!I39","v":"August 2015"},{"$f":"RentTable!J40 & \" \" & RentTable!J39","v":"September 2015"},{"$f":"RentTable!K40 & \" \" & RentTable!K39","v":"October 2015"},{"$f":"RentTable!L40 & \" \" & RentTable!L39","v":"November 2015"},"December 2023","TOTAL","Type Code Other","Rent Subsidy Other",null,"Type Code:"]
[null,null,null,null,null,null,{"$f":"((F5-E5)/E5)*100","v":{"$error":"#DIV/0!"}},null,{"$f":"IF($H5=I$3,F5,E5)","v":0},{"$f":"IF($H5=J$3,$F5,I5)","v":0},0,0,0,0,0,0,0,0,0,0,{"$f":"SUM(I5:T5)","v":0},null,null,null,"HH","High Home"]
[null,null,null,null,null,null,{"$f":"((F6-E6)/E6)*100","v":{"$error":"#DIV/0!"}},null,{"$f":"IF($H6=I$3,F6,E6)","v":0},{"$f":"IF($H6=J$3,$F6,I6)","v":0},{"$f":"IF($H6=K$3,$F6,J6)","v":0},{"$f":"IF($H6=L$3,$F6,K6)","v":0},{"$f":"IF($H6=M$3,$F6,L6)","v":0},{"$f":"IF($H6=N$3,$F6,M6)","v":0},{"$f":"IF($H6=O$3,$F6,N6)","v":0},{"$f":"IF($H6=P$3,$F6,O6)","v":0},{"$f":"IF($H6=Q$3,$F6,P6)","v":0},{"$f":"IF($H6=R$3,$F6,Q6)","v":0},{"$f":"IF($H6=S$3,$F6,R6)","v":0},{"$f":"IF($H6=T$3,$F6,S6)","v":0},{"$f":"SUM(I6:T6)","v":0},null,null,null,"LH","Low Home"]
[null,null,null,null,null,null,{"$error":"#DIV/0!"},null,0,0,0,0,0,0,0,0,0,0,0,0,0,null,null,null,"TC 20","Tax Credit 20%"]
[null,null,null,null,null,null,{"$error":"#DIV/0!"},null,0,0,0,0,0,0,0,0,0,0,0,0,0,null,null,null,"TC 30","Tax Credit 30%"]
[null,null,null,null,null,null,null,null,null,null,null,null,null,null,null,null,null,null,null,null,null,null,null,null,"TC 40","Tax Credt 40%"]
["TOTAL",null,null,null,null,null,null,null,{"$f":"SUM(I5:I8)","v":0},0,0,0,0,0,0,0,0,0,0,0,0,null,null,null,"TC 50","Tax Credit 50%"]
{"$rows_left_out":25}
{"sheet":"CapEx","index":4,"n_rows":47,"n_cols":16,"rows_kept":47,"cut":false,"hidden":false,"merged":[]}
[{"$f":"RentTable!A4","v":"Property Name"}]
[{"$f":"RentTable!A5","v":"Property Number1"},null,null,"Annual Budget - Schedule B"]
[{"$f":"RentTable!A6","v":2015},null,null,"Capital Expenditures"]
[{"$f":"RentTable!A7","v":"Property City"}]
[]
["A",null,null,"D"]
["Description",null,null,"Amount"]
[]
["Item1",null,null,0]
["Item2",null,null,0]
{"$rows_left_out":38}
{"sheet":"Budget","index":5,"n_rows":118,"n_cols":33,"rows_kept":118,"cut":false,"hidden":false,"merged":[]}
[{"$f":"RentTable!A4","v":"Property Name"},null,null,null,null,null,null,null,null,null,null,null,null,null,null,null,null,null,null,null,null,null,null,{"$f":"IF($J$55=0,\"Proposed Budget\",\"Approved Budget\")","v":"Proposed Budget"},null,null,27,28,29,30,31]
[{"$f":"RentTable!A5","v":"Property Number1"},{"$f":"RentTable!A7","v":"Property City"},null,"Proposed Budget",null,null,null,null,null,"Approved Budget",null,null,{"$f":"IF($J$55=0,\"Analysis of Proposed Budget\",\"Analysis of Approved Budget\")","v":"Analysis of Proposed Budget"}]
["Year:",{"$f":"RentTable!A6","v":2015},null,null,null,null,null,null,null,null,"Difference",null,{"$f":"B3","v":2015},{"$f":"M3","v":2015},{"$f":"M3","v":2015},{"$f":"M3","v":2015},null,{"$f":"RentTable!B39","v":2015},{"$f":"RentTable!C39","v":2015},{"$f":"RentTable!D39","v":2015},{"$f":"RentTable!E39","v":2015},{"$f":"RentTable!F39","v":2015},{"$f":"RentTable!G39","v":2015},{"$f":"RentTable!H39","v":2015},{"$f":"RentTable!I39","v":2015},{"$f":"RentTable!J39","v":2015},{"$f":"RentTable!K39","v":2015},{"$f":"RentTable!L39","v":2015},{"$f":"RentTable!M39","v":2015}]
["Rent. sq ft.:",{"$f":"RentTable!G37","v":0},"Actual","Estimate",{"$f":"F4-1","v":2014},{"$f":"J4","v":2015},"$","%",null,{"$f":"+$B$3","v":2015},"Between",null,{"$f":"IF($J$55=0,\"Proposed\",\"Approved\")","v":"Proposed"},{"$f":"IF($J$55=0,\"Proposed\",\"Approved\")","v":"Proposed"},{"$f":"IF($J$55=0,\"Proposed\",\"Approved\")","v":"Proposed"},{"$f":"IF($J$55=0,\"Proposed\",\"Approved\")","v":"Proposed"},null,"Approved","Approved","Approved","Approved","Approved","Approved","Approved","Approved","Approved","Approved","Approved","Approved","Approved"]
["Rooms:",{"$f":"RentTable!H37","v":0},"(Most recent","(Remainder","Estimate","Proposed ","Change","Change",null,"Approved","Proposed and",null,"Budget","Budget","Budget","Budget",null,"Budget","Budget","Budget","Budget","Budget","Budget","Budget","Budget","Budget","Budget","Budget","Budget","Budget"]
["Units:",{"$f":"RentTable!E37","v":0},"FORM 256)","of year)",null,"Budget","Est./Pro.","Est./Pro.",null,"Budget","Approved",null,"$/Room/Mon.","$/Unit/Mon.","$/Sq. Ft","% of GPI",null,{"$f":"RentTable!B40","v":"January"},{"$f":"RentTable!C40","v":"February"},{"$f":"RentTable!D40","v":"March"},{"$f":"RentTable!E40","v":"April"},{"$f":"RentTable!F40","v":"May"},{"$f":"RentTable!G40","v":"June"},{"$f":"RentTable!H40","v":"July"},{"$f":"RentTable!I40","v":"August"},{"$f":"RentTable!J40","v":"September"},{"$f":"RentTable!K40","v":"October"},{"$f":"RentTable!L40","v":"November"},{"$f":"RentTable!M40","v":"December"},"Test"]
[null,null,null,null,null,null,null,null,null,null,null,null,null,null,null,null,null,{"$f":"RentTable!B38","v":1},{"$f":"RentTable!C38","v":2},{"$f":"RentTable!D38","v":3},{"$f":"RentTable!E38","v":4},{"$f":"RentTable!F38","v":5},{"$f":"RentTable!G38","v":6},{"$f":"RentTable!H38","v":7},{"$f":"RentTable!I38","v":8},{"$f":"RentTable!J38","v":9},{"$f":"RentTable!K38","v":10},{"$f":"RentTable!L38","v":11},{"$f":"RentTable!M38","v":12}]
[null,"Last Year Economic Occupancy:  ",null,null,{"$f":"IF(E16=0,0,(E18+E19+E23)/E16)","v":0},null,null,null,null,{"$f":"E8","v":0},null,null,null,null,null,null,null,0,0,0,0,0,0,0,0,0,0,0,0]
[null,"Current Year # of Vacant Units:  ",null,null,null,null,null,null,null,null,null,null,null,null,null,null,null,0,0,0,0,0,0,0,0,0,0,0,0]
[null,"Current Economic Vacancy:  ",null,null,null,{"$f":"(F18+F19+F23)/F16","v":{"$error":"#DIV/0!"}},null,null,null,{"$f":"AVERAGE(R10:AC10)","v":{"$error":"#DIV/0!"}},null,null,null,null,null,null,null,{"$f":"(R18+R19+R23)/R16","v":{"$error":"#DIV/0!"}},{"$f":"(S18+S19+S23)/S16","v":{"$error":"#DIV/0!"}},{"$error":"#DIV/0!"},{"$error":"#DIV/0!"},{"$error":"#DIV/0!"},{"$error":"#DIV/0!"},{"$error":"#DIV/0!"},{"$error":"#DIV/0!"},{"$error":"#DIV/0!"},{"$error":"#DIV/0!"},{"$error":"#DIV/0!"},{"$error":"#DIV/0!"},null,null,"YTD","REMAINING"]
{"$rows_left_out":109}
{"sheet":"Budget Notes","index":6,"n_rows":8,"n_cols":3,"rows_kept":8,"cut":false,"hidden":false,"merged":[]}
["Please provide the following (this information is required)"]
["Vacancy rate used:"]
["Management fee being charged:"]
["Specify Basis for management fee:",null,"If % of collected income or combination, specify income source in Additional Notes."]
["Are you requesting a 2-tiered rent increase?(N/A for 100% Section 8 properties):",null,"If yes, complete that section on Rent Table."]
["Have you submitted utility allowance back up documentation? (N/A for 100% Section 8 properties or  if owner pays all utilities):"]
[]
["Additional Notes"]

{"sheet":"Actual","index":7,"n_rows":247,"n_cols":22,"rows_kept":247,"cut":false,"hidden":false,"merged":[]}
[null,{"$f":"RentTable!A4","v":"Property Name"},{"$f":"IF(C13=0,0,1)","v":0},0,0,0,0,0,0,0,0,0,0,0,{"$f":"IF(I2=TRUE,IF(O3=1,O4,O6),IF(O3=1,O2,O5))","v":13},null,"Analysis of Actual Operations"]
[null,{"$f":"RentTable!A5","v":"Property Number1"},null,{"$f":"RentTable!A7","v":"Property City"},null,null,null,null,false,null,null,null,null,null,{"$f":"IF(SUM(C1:N1)=0,13,SUM(C1:N1))","v":13},null,{"$f":"I4","v":2015},{"$f":"I4","v":2015},{"$f":"I4","v":2015},{"$f":"I4","v":2015}]
[null,"Year:  ",{"$f":"RentTable!A6","v":2015},null,null,null,null,"First Month of Accounting Cycle:",1,{"$f":"IF(I3=\"\",\"\",CHOOSE(I3,\"January\",\"February\",\"March\",\"April\",\"May\",\"June\",\"July\",\"August\",\"September\",\"October\",\"November\",\"December\"))","v":"January"},null,null,null,null,1,null,"Actual","Actual","Actual","Actual"]
[null,"Rent. Sq. Ft.:  ",{"$f":"Budget!B4","v":0},null,null,null,null,"Year of First Month of Acc. Cycle:",2015,null,null,null,null,null,{"$f":"IF(O2=13,13,IF(I3+O2-1<13,I3+O2-1,I3+O2-13))","v":13},null,"Operating","Operating","Operating","Operating"]
[null,"Rooms:  ",{"$f":"Budget!B5","v":0},null,null,null,null,"Accounting Method:","Accrual",null,null,null,null,null,null,null,"$/Room/M","$/Unit/M","$/Sq.Ft/M","% of GPI"]
[null,"Units:  ",{"$f":"Budget!B6","v":0},null,null,null,null,null,null,null,null,null,null,null,{"$f":"IF(I3+O5-1<13,I3+O5-1,I3+O5-13)","v":0},{"$f":"IF(O3=1,O2,O5)","v":13}]
[null,null,{"$f":"RentTable!B40","v":"January"},{"$f":"RentTable!C40","v":"February"},{"$f":"RentTable!D40","v":"March"},{"$f":"RentTable!E40","v":"April"},{"$f":"RentTable!F40","v":"May"},{"$f":"RentTable!G40","v":"June"},{"$f":"RentTable!H40","v":"July"},{"$f":"RentTable!I40","v":"August"},{"$f":"RentTable!J40","v":"September"},{"$f":"RentTable!K40","v":"October"},{"$f":"RentTable!L40","v":"November"},{"$f":"RentTable!M40","v":"December"},"YTD",null,null,null,null,null,null,"YTD"]
[null,null,{"$f":"RentTable!B39","v":2015},{"$f":"RentTable!C39","v":2015},{"$f":"RentTable!D39","v":2015},{"$f":"RentTable!E39","v":2015},{"$f":"RentTable!F39","v":2015},{"$f":"RentTable!G39","v":2015},{"$f":"RentTable!H39","v":2015},{"$f":"RentTable!I39","v":2015},{"$f":"RentTable!J39","v":2015},{"$f":"RentTable!K39","v":2015},{"$f":"RentTable!L39","v":2015},{"$f":"RentTable!M39","v":2015}]
[1,"Apartment Rent Potential",null,null,null,null,null,null,null,null,null,null,null,null,{"$f":"SUM(C9:N9)","v":0},null,{"$f":"IF(O9=0,0,V9/$C$5/$P$6)","v":0},{"$f":"IF(O9=0,0,V9/$C$6/$P$6)","v":0},{"$f":"IF(O9=0,0,V9/$C$4/$P$6)","v":0},{"$f":"V9/($V$13+$V$41)","v":{"$error":"#DIV/0!"}},null,{"$f":"CHOOSE($P$6,C9,SUM(C9:D9),SUM(C9:E9),SUM(C9:F9),SUM(C9:G9),SUM(C9:H9),SUM(C9:I9),SUM(C9:J9),SUM(C9:K9),SUM(C9:L9),SUM(C9:M9),SUM(C9:N9),0)","v":0}]
[2,"Parking/Garage Rent Potential",null,null,null,null,null,null,null,null,null,null,null,null,{"$f":"SUM(C10:N10)","v":0},null,{"$f":"IF(O10=0,0,V10/$C$5/$P$6)","v":0},{"$f":"IF(O10=0,0,V10/$C$6/$P$6)","v":0},{"$f":"IF(O10=0,0,V10/$C$4/$P$6)","v":0},{"$f":"V10/($V$13+$V$41)","v":{"$error":"#DIV/0!"}},null,{"$f":"CHOOSE($P$6,C10,SUM(C10:D10),SUM(C10:E10),SUM(C10:F10),SUM(C10:G10),SUM(C10:H10),SUM(C10:I10),SUM(C10:J10),SUM(C10:K10),SUM(C10:L10),SUM(C10:M10),SUM(C10:N10),0)","v":0}]
{"$rows_left_out":238}
{"sheet":"Actual Notes","index":8,"n_rows":0,"n_cols":0,"rows_kept":0,"cut":false,"hidden":false,"merged":[]}

{"sheet":"258 A","index":9,"n_rows":89,"n_cols":10,"rows_kept":89,"cut":false,"hidden":false,"merged":[[0,3,0,5]]}
[null,{"$f":"'258 B'!B1","v":"Property Name"},{"$f":"'258 B'!C1","v":"Property City"},{"$f":"'258 B'!D1","v":""},null,null,{"$f":"'258 B'!F1","v":"Property Number1"}]
[]
[null,null,"(1)","(2)","(3)","(4)","(5)"]
[null,null,"Actual",null,"Budget","Annual"]
[null,null,"Month","To-Date","To-Date","Budget","Comments"]
[1,"Apartment Rent Potential",{"$f":"CHOOSE(Actual!$P$6,Actual!C9,Actual!D9,Actual!E9,Actual!F9,Actual!G9,Actual!H9,Actual!I9,Actual!J9,Actual!K9,Actual!L9,Actual!M9,Actual!N9,0)","v":0},{"$f":"Actual!V9","v":0},{"$f":"Budget!AF12","v":0},{"$f":"Budget!J12","v":0}]
[2,"Parking/Garage Rent Potential",{"$f":"CHOOSE(Actual!$P$6,Actual!C10,Actual!D10,Actual!E10,Actual!F10,Actual!G10,Actual!H10,Actual!I10,Actual!J10,Actual!K10,Actual!L10,Actual!M10,Actual!N10,0)","v":0},{"$f":"Actual!V10","v":0},{"$f":"Budget!AF13","v":0},{"$f":"Budget!J13","v":0}]
[3,"Commercial Rent Potential",{"$f":"CHOOSE(Actual!$P$6,Actual!C11,Actual!D11,Actual!E11,Actual!F11,Actual!G11,Actual!H11,Actual!I11,Actual!J11,Actual!K11,Actual!L11,Actual!M11,Actual!N11,0)","v":0},{"$f":"Actual!V11","v":0},{"$f":"Budget!AF14","v":0},{"$f":"Budget!J14","v":0}]
[4,"Miscellaneous Rent Potential",{"$f":"CHOOSE(Actual!$P$6,Actual!C12,Actual!D12,Actual!E12,Actual!F12,Actual!G12,Actual!H12,Actual!I12,Actual!J12,Actual!K12,Actual!L12,Actual!M12,Actual!N12,0)","v":0},{"$f":"Actual!V12","v":0},{"$f":"Budget!AF15","v":0},{"$f":"Budget!J15","v":0}]
[5,"Gross Potential Rent (Lines 1-4)",{"$f":"SUM(C6:C9)","v":0},{"$f":"SUM(D6:D9)","v":0},{"$f":"SUM(E6:E9)","v":0},{"$f":"SUM(F6:F9)","v":0}]
{"$rows_left_out":80}
{"sheet":"258 B","index":10,"n_rows":104,"n_cols":6,"rows_kept":104,"cut":false,"hidden":false,"merged":[[0,3,0,4],[96,5,97,5]]}
[null,{"$f":"RentTable!A4","v":"Property Name"},{"$f":"RentTable!A7","v":"Property City"},{"$f":"IF(Months=13,\"\",CONCATENATE(\"For the Month of \",INDEX(MList,2,Actual!P6),\" - \",INDEX(MList,1,Actual!P6)))","v":""},null,{"$f":"RentTable!A5","v":"Property Number1"}]
[]
[null,null,"Actual",null,"Budget","Current"]
[null,"Part 1","Current Month","Year-To-Date","Year-To-Date","Balances"]
[1,"Apartment Rent Potential",{"$f":"CHOOSE(Actual!$P$6,Actual!C9,Actual!D9,Actual!E9,Actual!F9,Actual!G9,Actual!H9,Actual!I9,Actual!J9,Actual!K9,Actual!L9,Actual!M9,Actual!N9,0)","v":0},{"$f":"Actual!V9","v":0},{"$f":"Budget!AF12","v":0}]
[2,"Parking/Garage Rent Potential",{"$f":"CHOOSE(Actual!$P$6,Actual!C10,Actual!D10,Actual!E10,Actual!F10,Actual!G10,Actual!H10,Actual!I10,Actual!J10,Actual!K10,Actual!L10,Actual!M10,Actual!N10,0)","v":0},{"$f":"Actual!V10","v":0},{"$f":"Budget!AF13","v":0}]
[3,"Commercial Rent Potential",{"$f":"CHOOSE(Actual!$P$6,Actual!C11,Actual!D11,Actual!E11,Actual!F11,Actual!G11,Actual!H11,Actual!I11,Actual!J11,Actual!K11,Actual!L11,Actual!M11,Actual!N11,0)","v":0},{"$f":"Actual!V11","v":0},{"$f":"Budget!AF14","v":0}]
[4,"Miscellaneous Rent Potential",{"$f":"CHOOSE(Actual!$P$6,Actual!C12,Actual!D12,Actual!E12,Actual!F12,Actual!G12,Actual!H12,Actual!I12,Actual!J12,Actual!K12,Actual!L12,Actual!M12,Actual!N12,0)","v":0},{"$f":"Actual!V12","v":0},{"$f":"Budget!AF15","v":0}]
[5,"Gross Potential Rent (Lines 1-4)",{"$f":"SUM(C5:C8)","v":0},{"$f":"Actual!V13","v":0},{"$f":"Budget!AF16","v":0}]
[]
{"$rows_left_out":95}
{"sheet":"258 C","index":11,"n_rows":41,"n_cols":6,"rows_kept":41,"cut":false,"hidden":false,"merged":[]}
["Minnesota Housing"]
["Monthly Operating Report - Form 258 C"]
[]
[{"$f":"+'258 B'!D1","v":""}]
[]
[{"$f":"+'258 B'!B1","v":"Property Name"},null,null,null,null,{"$f":"+'258 B'!F1","v":"Property Number1"}]
[]
[{"$f":"+'258 B'!C1","v":"Property City"}]
[]
[0,null,"Balance from previous month"]
{"$rows_left_out":32}
{"sheet":"258 D","index":12,"n_rows":53,"n_cols":5,"rows_kept":53,"cut":false,"hidden":false,"merged":[]}
[null,"Minnesota Housing"]
[null,"Monthly Operating Report - Form 258 D"]
[]
[null,{"$f":"+'258 B'!D1","v":""},null,null,{"$f":"+'258 B'!F1","v":"Property Number1"}]
[]
[null,{"$f":"+'258 B'!B1","v":"Property Name"}]
[]
[null,{"$f":"+'258 B'!C1","v":"Property City"}]
[]
[null,null,"Column A","Column B","Column C"]
{"$rows_left_out":44}
{"sheet":"OpSubsidy","index":13,"n_rows":51,"n_cols":24,"rows_kept":51,"cut":false,"hidden":false,"merged":[[0,0,0,17],[7,1,7,15],[46,1,50,16]]}
["OPERATING SUBSIDY",null,null,null,null,null,null,null,null,null,null,null,null,null,null,null,null,null,null,null,false,null,null,{"$f":"MID($B$47,1,253)","v":""}]
[null,null,null,null,null,null,null,null,null,null,null,null,null,null,null,null,null,null,null,null,false,null,null,{"$f":"MID($B$47,254,253)","v":""}]
["Development Name  ",{"$f":"RentTable!A4","v":"Property Name"},null,null,null,null,null,null,null,null,null,null,null,null,null,null,null,null,null,null,null,null,null,{"$f":"MID($B$47,508,253)","v":""}]
["MH #  ",{"$f":"RentTable!A5","v":"Property Number1"},null,null,null,null,null,null,null,null,null,null,null,null,null,null,null,null,null,null,null,null,null,{"$f":"MID($B$47,762,253)","v":""}]
["Current Reporting Year  ",{"$f":"RentTable!A6","v":2015},null,null,null,null,null,null,null,null,null,null,null,null,null,null,null,null,null,null,null,null,null,{"$f":"MID($B$47,1016,253)","v":""}]
["Units  ",{"$f":"RentTable!E37","v":0}]
["Rooms  ",{"$f":"RentTable!H37","v":0}]
[]
[]
[]
{"$rows_left_out":42}
{"sheet":"YEP","index":14,"n_rows":238,"n_cols":23,"rows_kept":238,"cut":false,"hidden":false,"merged":[]}
[{"$f":"BaseData!D5 & \"-\" & DevNum","v":"-"}]
[{"$f":"BaseData!D6","v":0}]
["Year:  ",{"$f":"BaseData!D7","v":0},"F",{"$f":"RentTable!B39","v":2015},{"$f":"RentTable!C39","v":2015},{"$f":"RentTable!D39","v":2015},{"$f":"RentTable!E39","v":2015},{"$f":"RentTable!F39","v":2015},{"$f":"RentTable!G39","v":2015},{"$f":"RentTable!H39","v":2015},{"$f":"RentTable!I39","v":2015},{"$f":"RentTable!J39","v":2015},{"$f":"RentTable!K39","v":2015},{"$f":"RentTable!L39","v":2015},{"$f":"RentTable!M39","v":2015},{"$f":"RentTable!A6","v":2015},{"$f":"RentTable!A6","v":2015},{"$f":"RentTable!A6","v":2015},{"$f":"RentTable!A6","v":2015},"$/Room","$/Unit/M","$/Sq. Ft.","% of GPI"]
["Rentable Sq. Ft.:  ",{"$f":"RentTable!G37","v":0},"l",null,null,null,null,null,null,null,null,null,null,null,null,"Year End",{"$f":"P4","v":"Year End"},"Approved","Variance to","Year End","Year End","Year End","Year End"]
["Rooms:  ",{"$f":"RentTable!H37","v":0},"a",{"$f":"IF(Actual!C9=0,\"Budget\",\"Actual\")","v":"Budget"},{"$f":"IF(Actual!D9=0,\"Budget\",\"Actual\")","v":"Budget"},{"$f":"IF(Actual!E9=0,\"Budget\",\"Actual\")","v":"Budget"},{"$f":"IF(Actual!F9=0,\"Budget\",\"Actual\")","v":"Budget"},{"$f":"IF(Actual!G9=0,\"Budget\",\"Actual\")","v":"Budget"},{"$f":"IF(Actual!H9=0,\"Budget\",\"Actual\")","v":"Budget"},{"$f":"IF(Actual!I9=0,\"Budget\",\"Actual\")","v":"Budget"},{"$f":"IF(Actual!J9=0,\"Budget\",\"Actual\")","v":"Budget"},{"$f":"IF(Actual!K9=0,\"Budget\",\"Actual\")","v":"Budget"},{"$f":"IF(Actual!L9=0,\"Budget\",\"Actual\")","v":"Budget"},{"$f":"IF(Actual!M9=0,\"Budget\",\"Actual\")","v":"Budget"},{"$f":"IF(Actual!N9=0,\"Budget\",\"Actual\")","v":"Budget"},"Projection",{"$f":"P5","v":"Projection"},"Budget","Budget","Projection","Projection","Projection","Projection"]
["Units:  ",{"$f":"BaseData!D13","v":0},"g",{"$f":"RentTable!B40","v":"January"},{"$f":"RentTable!C40","v":"February"},{"$f":"RentTable!D40","v":"March"},{"$f":"RentTable!E40","v":"April"},{"$f":"RentTable!F40","v":"May"},{"$f":"RentTable!G40","v":"June"},{"$f":"RentTable!H40","v":"July"},{"$f":"RentTable!I40","v":"August"},{"$f":"RentTable!J40","v":"September"},{"$f":"RentTable!K40","v":"October"},{"$f":"RentTable!L40","v":"November"},{"$f":"RentTable!M40","v":"December"},null,null,null,null,{"$f":"P3","v":2015},{"$f":"R3","v":2015},{"$f":"S3","v":2015},{"$f":"V6","v":2015}]
[]
[]
[null,"Current Year # of Vacant Units/Month:",null,{"$f":"$B$6*(D10)","v":0},0,0,0,0,0,0,0,0,0,0,0,{"$f":"AVERAGE(D9:O9)","v":0},{"$f":"+P9","v":0},{"$f":"AVERAGE(D9:O9)","v":0}]
[null,"Current Economic Vacancy:",null,{"$f":"IF(D16=0,0,(1-(D27+D22)/D16))","v":0},0,0,0,0,0,0,0,0,0,0,0,{"$f":"AVERAGE(D10:O10)","v":0},{"$f":"P10","v":0},{"$f":"AVERAGE(D10:O10)","v":0},{"$f":"+P10-R10","v":0}]
{"$rows_left_out":229}
{"sheet":"Lists","index":15,"n_rows":31,"n_cols":2,"rows_kept":31,"cut":false,"hidden":true,"merged":[]}
["Type Code:"]
["HH","High Home"]
["LH","Low Home"]
["TC 20","Tax Credit 20%"]
["TC 30","Tax Credit 30%"]
["TC 40","Tax Credt 40%"]
["TC 50","Tax Credit 50%"]
["TC 60","Tax Credit 60%"]
["TC 70","Tax Credit 70%"]
["TC 80","Tax Credit 80%"]
{"$rows_left_out":22}
{"sheet":"BaseData","index":16,"n_rows":4,"n_cols":3,"rows_kept":4,"cut":false,"hidden":true,"merged":[]}
["L:\\MFPMS\\jaj\\","DataDir",{"$f":"LEN(DataDir)","v":13}]
[{"$f":"RIGHT(DataPath,LEN(DataPath)-LEN(DataDir))","v":"Lyndale AvenueTest.xls"},"DataFile",{"$f":"LEN(DataFile)","v":22}]
["L:\\MFPMS\\jaj\\Lyndale AvenueTest.xls","DataPath",{"$f":"LEN(DataPath)","v":35}]
[{"$f":"ThisFileName()","v":"BudRep v20230830.xlsm"},"BudgetFile",{"$f":"LEN(BudgetFile)","v":21}]